عناصر ترانهادنی
preferred label: transposable elements @en
type: Concept
narrower: رتروترانس‌پوزون‌ها

رتروترانس‌پوزون‌ها
alternative label: رتروپوزون‌ها
scope note: eukaryotic transposable elements that transpose through RNA intermediates
related: رتروویریده
broader: عناصر ترانهادنی
preferred label: retrotransposons @en
type: Concept

رتروویریده
preferred label: Retroviridae @en
type: Concept
related: رتروترانس‌پوزون‌ها