حقوق کشاورزان
scope note: rights of farmers to control the seed and other propagation materials grown on their farms and to obtain benefit from the germplasm they preserve
related: زارعان
broader: حقوق قانونی
preferred label: farmers' rights @en
type: Concept

زارعان
preferred label: farmers @en
type: Concept
related: حقوق کشاورزان

حقوق قانونی
preferred label: legal rights @en
type: Concept
narrower: حقوق کشاورزان