خواص الکتریکی
preferred label: electrical properties @en
type: Concept
narrower: قطبش

قطبش
scope note: nonrandom orientation of electric and magnetic fields; for polarization of light use optical rotation
related: الکترولیت‌ها
broader: خواص الکتریکی
preferred label: polarization @en
type: Concept

الکترولیت‌ها
preferred label: electrolytes @en
type: Concept
related: قطبش