آلرژی‌ها
preferred label: allergies @en
type: Concept
related: آنافیلاکسی

آنافیلاکسی
alternative label: واکنش‌هاي آنافيلاکتيک
scope note: acute immediate hypersensitivity, generalized or localized
related: آلرژی‌ها
broader: پرحساسیتی
preferred label: anaphylaxis @en
type: Concept

پرحساسیتی
preferred label: hypersensitivity @en
type: Concept
narrower: آنافیلاکسی