immunity by process
preferred label: ایمنی براساس فرایند @fa
type: Concept
narrower: premunition

premunition
alternative label: premunity
scope note: resistance to reinfection after an acute infection has become chronic @fa
related: immunity
broader: immunity by process
preferred label: پیش‌زینهاری @fa
type: Concept

immunity
preferred label: ایمنی @fa
type: Concept
related: premunition