همگروه سازی رویان
scope note: production of genetically identical embryos
broader: روش‌های اصلاح نژاد عمومی
preferred label: embryo cloning @en
type: Concept

روش‌های اصلاح نژاد عمومی
preferred label: general breeding methods @en
type: Concept
narrower: همگروه سازی رویان