کشت توام
preferred label: intercropping @en
type: Concept
narrower: زراعت‌های چندکشتی

زراعت‌های چندکشتی
alternative label: کشت چند طبقه اي
scope note: agroforestry systems with multiple species of annuals and perennials with an existing stand of perennials
broader: کشت توام
preferred label: multistorey cropping @en
type: Concept