agrosilviaquacultural systems
alternative label: agrosilvofishery
scope note: agroforestry systems combining woody perennials, agricultural crops and raising freshwater aquatic animals @fa
broader: farming systems
preferred label: سیستم‌های کشت‌آبی خاک و جنگل @fa
type: Concept

farming systems
preferred label: سیستم‌های زراعی @fa
type: Concept
narrower: agrosilviaquacultural systems