آزمون‌ها
preferred label: tests @en
type: Concept
narrower: آزمون‌های عملکرد

آزمون‌های عملکرد
scope note: performance of equipment or materials; for animal performance use performance testing
broader: آزمون‌ها
preferred label: performance tests @en
type: Concept