ابرانگلی
scope note: parasitism where the parasite burden from a single species is greater than the host can sustain
broader: زندگی انگلی
preferred label: superparasitism @en
type: Concept

زندگی انگلی
preferred label: parasitism @en
type: Concept
narrower: ابرانگلی