تکامل
preferred label: evolution @en
type: Concept
narrower: گونه‌زایی
related: گونه‌زایی

گونه‌زایی
scope note: biological; for chemicals use chemical speciation
related: گونه
related: تکامل
broader: تکامل
preferred label: speciation @en
type: Concept

گونه
preferred label: species @en
type: Concept
related: گونه‌زایی