تکوین غیرطبیعی
preferred label: abnormal development @en
type: Concept
narrower: نارس(گیاهان)

نارس(گیاهان)
scope note: premaure termination of the development of pollen, gametes, embryos, seeds, fruits, flowers, etc.
narrower: نارس‌ماندگی بذر
broader: تکوین غیرطبیعی
preferred label: abortion (plants) @en
type: Concept

نارس‌ماندگی بذر
preferred label: seed abortion @en
type: Concept
broader: نارس(گیاهان)