وردایی ژنتیکی
preferred label: genetic variation @en
type: Concept
narrower: گوناگونی ژنتیکی

گوناگونی ژنتیکی
scope note: amount of genetic variation in a population or species that enables it to adapt to environmental change
broader: وردایی ژنتیکی
preferred label: genetic diversity @en
type: Concept