مهارتهای زندگی روزانه
alternative label: مهارتهاي زندگي
scope note: personal management and social skills which are necessary for adequate functioning on an independent basis
broader: مهارتها
preferred label: daily living skills (AGRICOLA) @en
type: Concept

مهارتها
preferred label: skills @en
type: Concept
narrower: مهارتهای زندگی روزانه