خواص متفرقه خاک
preferred label: miscellaneous soil properties @en
type: Concept
narrower: شایستگی خاک

شایستگی خاک
scope note: suitability of specific soil types or soil properties for particular crops; for the more general capability of land for various uses use land capability
broader: خواص متفرقه خاک
preferred label: soil suitability @en
type: Concept