برنامه واکنش به فاجعه
type: Concept
preferred label: Disaster plan @en
related: برنامه‌ریزی واکنش به فاجعه

برنامه‌ریزی واکنش به فاجعه
type: Concept
alternative label: برنامه‌ریزی مقابله با فاجعه
broader: مدیریت وضع اضطراری
preferred label: Disaster planning @en
related: برنامه واکنش به فاجعه
scope note: این نوع برنامه‌ریزی دامنه گسترده‌ای از فعالیت‌ها را شامل می‌شود، مثل ساخت و سازهای مهندسی دفاعی، برنامه‌ریزی کاربری زمین و تنظیم آن و پراکندگی متعادل مردم و حمایت و نگهداری برنامه‌های تخلیه و انتقال، ترتیب و تنظیم امور آگاهی‌رسانی فوری به مردم و توانمندی مؤثر سازمان‌های دولتی در اجرای برنامه تخلیه و انتقال در محل، ترمیم و بهسازی و بازسازی و عادی‌سازی و مانند اینها.

مدیریت وضع اضطراری
type: Concept
narrower: برنامه‌ریزی واکنش به فاجعه
preferred label: Emergency management @en