همکاری سازمان‌های خدمات اضطراری
type: Concept
broader: همکاری
preferred label: Emergency services cooperation @en

همکاری
type: Concept
narrower: همکاری سازمان‌های خدمات اضطراری
preferred label: Cooperation @en
scope note: همکاری گروهی از افراد، چه رسمی و چه غیررسمی، دلخواهانه یا نادلخواهانه، در راه هدف معین به منظور نفع مشترک یا به امید پاداش و سود.