Spontaneous combustion
type: Concept
broader: Combustion
preferred label: سوختن خودبه‌خود @fa

Combustion
type: Concept
narrower: Spontaneous combustion
preferred label: سوختن @fa
scope note: (a) Consumption of fuels by oxidation, givng out heat, and generally flame and/or incandescence. (b) The process of burning.
scope note: فرایند مصرف سوخت از طریق اکسایش، بیرون دادن گرما و به‌طور کلی شعله آتش و یا گدازش. @fa