سیل‌بندی
type: Concept
preferred label: Flood control @en
related: زهکشی

زهکشی
type: Concept
preferred label: Drainage @en
related: سیل‌بندی
scope note: انتقال آب‌های زیرزمینی یا رو زمینی، یا آبی که از سازه‌ها بیرون می‌آید به کمک نیروی گرانشی (ثقلی) یا با تلمبه‌زنی (پمپاژ).