شخص ناتوان
type: Concept
preferred label: Disabled person @en
related: مشکل‌دار (جسمی یا روانی)

مشکل‌دار (جسمی یا روانی)
type: Concept
alternative label: آدم مشکل‌دار (جسمی یا روانی)
preferred label: Handicapped @en
related: شخص ناتوان
scope note: Persons with physical or mental disabilities that affect or limit their activities of daily living and that may require special accommodations. @en
scope note: مشخص‌کننده کسی که از جنبه روانی یا جسمی دچار محدودیت عملکردی یا ناتوانی یا معلولیت یا نقص است یا افراد دارای ناتوانی جسمی و روحی که فعالیت‌های روزانه زندگی آنها را محدود می‌کند و بر آن تأثیر می‌گذارد و به مکانی خاص برای سکونت نیاز دارند.