سندرم له‌شدگی
type: Concept
broader: آسیب له‌شدگی
preferred label: Crush syndrome @en

آسیب له‌شدگی
type: Concept
broader: زخم و آسیب
narrower: سندرم له‌شدگی
preferred label: Crush injury @en
scope note: قرارگرفتن بخشی از بدن، تحت درجه بالایی از فشار یا نیرو، به‌ویژه وقتی که بین اشیای سنگین یا غیر متحرک قرار گیرد و له شود.

زخم و آسیب
type: Concept
narrower: آسیب له‌شدگی
preferred label: Wound and injury @en