بوم‌سامانه
type: Concept
alternative label: نظام زیست‌بومی
preferred label: Ecosystem @en
related: محیط زیست
scope note: Interacting systems of biological communities, both plant and animal and their non-living surroundings. @en
scope note: نظام برهم‌کنش ارتباطات زیستی، گیاهان، جانوران و محیط‌های غیر زنده یا یک سیستم باز که شامل گیاهان، حیوانات، بقایای مواد آلی، گازهای اتمسفری، آب و مواد معدنی بوده، و این‌ها همه در جریان انرژی و چرخش ماده نقش دارند.

محیط زیست
type: Concept
preferred label: Environment @en
related: بوم‌سامانه