Terrorism
type: Concept
preferred label: تروریسم @fa
related: Bombing

Bombing
type: Concept
preferred label: بمب‌گذاری @fa
related: Blast effect
related: Terrorism
related: Bomb
scope note: Use of explosive devices for purposes of political terrorism, protest, etc.
scope note: کاربرد ابزار انفجاری برای هدف‌های سیاسی، تروریسم، اعتراض و مانند اینها. @fa

Bomb
type: Concept
preferred label: بمب @fa
related: Bombing

Blast effect
type: Concept
preferred label: اثر انفجار @fa
related: Bombing