Emergency planning
type: Concept
preferred label: برنامه‌ریزی وضع اضطراری @fa
related: Civil defense

Emergency service
type: Concept
preferred label: سازمان خدمات اضطراری @fa
related: Civil defense

Bomb reconnaissance
type: Concept
preferred label: شناسایی بمب @fa
related: Civil defense

Civil defense
type: Concept
alternative label: Civil defence
preferred label: دفاع غیرنظامی @fa
related: Emergency planning
related: Bomb reconnaissance
related: Emergency service
scope note: The measures necessary to protect the civilian population of the State from the effects of enemy attack or hostilities and to help it recover from the immediate effects of a disaster or war-like act.
scope note: مساعی نظام یافته یا طرحها و برنامه‌های حکومتی برای آمادگی ملی و جلوگیری از غافلگیری مردم در مواقع اضطراری و نیز محدود کردن اتفاقات و خسارت‌های احتمالی به امور غیر نظامیان در طول جنگ و درگیری و کمک به بهسازی آثار سریع یک فاجعه یا حادثه. @fa