آلودگی ماده پرتوزا
type: Concept
broader: ماده پرتوزا
preferred label: Radioactive pollution @en
scope note: آلودگی ناشی از مواد پرتوزای پراکنده در محیط که از طریق تنفس، بلع، جذب پوستی و مانند اینها به جانداران آسیب وارد می‌شود.

ماده پرتوزا
type: Concept
narrower: آلودگی ماده پرتوزا
preferred label: Radioactive material @en