Records management
type: Concept
preferred label: مدیریت اسناد و مدارک @fa
related: Freedom of information

Information management
type: Concept
preferred label: مدیریت اطلاعات @fa
related: Freedom of information

Freedom of information
type: Concept
alternative label: FOI
preferred label: آزادی دسترسی به اطلاعات @fa
related: Records management
related: Information management
scope note: آزادی دسترسی شهروندان به اطلاعات، اسناد و مدارک دولتی. طرفداران آزادی دسترسی به اطلاعات اعتقاد دارند که دانستن، حق مردم است و مردم بر اساس این اصل است که بهتر در بحث‌ها شرکت می‌کنند. سوئد اولین کشوری بود که در سال 1766 حق دستیابی به مدارک دولتی را برقرار کرد. @fa