امداد به فاجعه‌دیدگان
type: Concept
preferred label: Disaster relief @en
related: کمک به فاجعه‌دیدگان

کمک به فاجعه‌دیدگان
type: Concept
preferred label: Disaster assistance @en
related: امداد به فاجعه‌دیدگان
scope note: آماده‌سازی پناهگاه فوری، کمک به گذران زندگی و توجه به نیازهای افراد مواجه شده یا قرار گرفته در معرض فاجعه یا وضع اضطراری. کمک به فاجعه‌دیدگان با سه هدف رفاه‌بخشی، توانبخشی و نوسازی یا تجدید بناهای تخریب شده صورت می‌گیرد.