نظام اطلاعاتی
type: Concept
preferred label: Information system @en
related: فناوری اطلاعات

فناوری اطلاعات
type: Concept
alternative label: آی تی
broader: فناوری
preferred label: Information technology @en
related: نظام اطلاعاتی
scope note: مجموعه فنون و فعالیت‌هایی که در آنها رایانه و فناوری ارتباطات برای ایجاد، ذخیره‌سازی، پردازش، ارائه، مبادله و مدیریت اطلاعات، مورد استفاده قرار می‌گیرد.

فناوری
type: Concept
narrower: فناوری اطلاعات
preferred label: Technology @en