Acceptable risk
type: Concept
broader: Risk
preferred label: احتمال خطر پذیرفتنی @fa
scope note: Degree of human or material loss that is perceived by the community or relevant authorities as tolerable in actions.
scope note: میزان آسیب مالی یا جانی که از سوی جامعه یا افراد متخصص در این زمینه در حد قابل قبولی از خطر محسوب شود. هنوز در مورد رضایت تجسم یافته قبول احتمال خطر و میزان اطلاعی که برای هر شخص در تصمیم‌گیری مدلل امور مربوط به احتمال خطر ضروری است تفاهم وجود ندارد. حصول به این مطلب مشکل است زیرا نگرش‌های احتمال خطر پذیرفتنی به‌طور مداوم تغییر می‌کنند. مثلاً امکان دارد بعد از یک واقعه نادر و زیانبار دستور حفاظت بهتر و ایمنی عالی‌تر از سوی جامعه صادر شود. @fa

Risk
type: Concept
narrower: Acceptable risk
preferred label: احتمال خطر @fa