Earthquake intensity
preferred label: شدت زلزله @fa
type: Concept
related: Earthquake magnitude

Earthquake
preferred label: زلزله @fa
type: Concept
related: Earthquake magnitude

Earthquake magnitude
scope note: A quantity that is characteristic of the total energy released by an earthquake, in contrast to 'intensity' which subjectively describes earthquake effects at particular place.
scope note: کمیت مشخص‌کننده انرژی کل آزاد شده از زلزله در مقابل شدت توصیف کننده آثار زلزله در منطقه‌ای خاص. هر چه مقدار انرژی آزاد شده یک زلزله بیشتر باشد، مدت زمان لرزش بیشتر است، مثلاً مدت زمان لرزش بزرگی زلزله 7 ریشتری در بستر سنگ 16 ثانیه و در بستر خاک 32 ثانیه است. @fa
related: Earthquake intensity
related: Earthquake
preferred label: بزرگی زلزله @fa
type: Concept