ترس از مکان بسته
alternative label: هراس از مکان‌های بسته
scope note: ترس شخص از مناطق و محل‌های سرپوشیده، باریک و بسته مثل تونل، آسانسور، سینما، کلاس درس، کوچه‌های باریک. ترس از مکان بسته ممکن است بازتاب ترس از یک وسوسه (مثلآ تحریک جنسی) یا نشانه تنبیه کردن خود به خاطر وسوسه در شرف تکوین و یا نشانه ترکیبی از آنها باشد.
broader: رفتار انسانی
preferred label: Claustrophobia @en
type: Concept

رفتار انسانی
preferred label: Human behavior @en
type: Concept
narrower: ترس از مکان بسته