خدمات رفاهی
preferred label: Welfare services @en
type: Concept
related: رفاه عمومی

رفاه عمومی
scope note: رفاه کل یک جامعۀ معین از طریق بهبود وضع اقتصادی، اجتماعی، فرهنگی، بهداشتی و حمایت دولت از کم‌دارها.
related: خدمات رفاهی
preferred label: Public welfare @en
type: Concept