بررسی خطر
alternative label: ممیّزی خطر
scope note: Detailed and comprehensive reviews of all operational and organisational safety systems and practises. @en
scope note: وارسی و ارزیابی دقیق و جامع تمام شیوه‌ها و میزان کارایی سیستم‌های ایمنی سازمانی و عملیاتی.
related: تجزیه و تحلیل احتمال خطر
preferred label: Hazard audit @en
type: Concept

تجزیه و تحلیل احتمال خطر
preferred label: Risk analysis @en
type: Concept
related: بررسی خطر