Earthquake risk
alternative label: Seismic risk
scope note: The probability of earthquakes of given magnitude occurring in a region.
scope note: احتمال وقوع زلزله پرقدرت در یک منطقه. @fa
broader: Earthquake
preferred label: احتمال خطر زلزله @fa
type: Concept

Earthquake
preferred label: زلزله @fa
type: Concept
narrower: Earthquake risk