Earthquake
preferred label: زلزله @fa
type: Concept
narrower: Aftershock

Aftershock
scope note: Smaller earthquakes following the largest earthquake of a series concentrated in a restricted crustal volume.
scope note: زمین‌لرزه‌های کوچکی که در پی زمین‌لرزه بزرگتری می‌‌آیند و به یک سری متمرکز در حجم بسیار محدود تعلق دارند. شدیدترین تکان، لرزه اصلی و تکان‌های بعدی را پسلرزه می‌نامند. @fa
related: Foreshock
broader: Earthquake
preferred label: پسلرزه @fa
type: Concept

Foreshock
preferred label: پیشلرزه @fa
type: Concept
related: Aftershock