زلزله
preferred label: Earthquake @en
type: Concept
narrower: رو‌مرکز

رو‌مرکز
alternative label: اپی‌سانتر
scope note: Apoint on the Earth's surface directly above the focus of an earthquake. @en
scope note: نقطه ظهور و انتشار زمین‌لرزه در سطح زمین که مستقیماً در بالای مرکز زلزله واقع است.
broader: زلزله
preferred label: Epicenter @en
type: Concept