Fault (Geology)
scope note: A fracture or zone of fractures in rock along which the two sides have been displaces relative to each other parallel to the fracture.
scope note: نوعی شکست که بر اثر وارد آمدن فشار به پوسته زمین و جابه‌جایی لایه‌های آن ایجاد می‌شود. بیشتر زلزله‌ها بر روی گسل‌های قدیمی متمرکزند. وجود گسل‌های زیاد در یک منطقه موجب بروز زلزله است و خود زلزله، گسل‌های جدیدی به وجود می‌آورد که در نتیجه قابلیت زلزله‌خیزی منطقه را افزایش می‌دهد. @fa
broader: Earthquake
preferred label: گسل @fa
type: Concept

Earthquake
preferred label: زلزله @fa
type: Concept
narrower: Fault (Geology)