فاجعه طبیعی
preferred label: Natural disaster @en
type: Concept
narrower: سونامی

مقیاس شدت سونامی
preferred label: Tsunami intensity scale @en
type: Concept
related: سونامی

سیستم هشداردهی سونامی
preferred label: Tsunami warning system @en
type: Concept
related: سونامی

خیزاب توفان
preferred label: Storm surge @en
type: Concept
related: سونامی

سونامی
related: خیزاب توفان
related: خطر زلزله
related: مقیاس شدت سونامی
related: سیستم هشداردهی سونامی
broader: فاجعه طبیعی
scope note: A water wave generated by a sudden change in the sea bed resulting from an earthquake, volcanic eruption or landslide. @en
scope note: واژۀ ژاپنی برای بیان امواج عظیم اقیانوس که بر اثر فعالیت‌های زلزله یا آتشفشان زیردریایی ایجاد می‌شوند و در صورت برخورد با سواحل، خسارات مالی و یا حتی جانی وارد می‌کنند. مرز بین بعضی از ورقه‌های زمین که حرکات آنها عامل اصلی زلزله است، تقریباً با مرز بین اقیانوس آرام مطابقت دارد. از این‌رو ، طبیعی است که بسیاری از زلزله‌های شدید در نزدیکی سواحل اقیانوس آرام روی دهد.
alternative label: توفان شدید دریایی ناشی از زلزله
type: Concept
preferred label: Tsunami @en

خطر زلزله
preferred label: Earthquake hazard @en
type: Concept
related: سونامی