مدیریت امور کارکنان
preferred label: Personnel management @en
type: Concept
related: غیبت از کار

غیبت از کار
scope note: کارگریزی یا عدم حضور غیرموجه کارگر و کارمند در محل کار موظف خود.
related: مدیریت امور کارکنان
preferred label: Absenteeism @en
type: Concept