تنش
preferred label: Stress @en
type: Concept
narrower: تنش فیزیولوژیکی

تنش فیزیولوژیکی
scope note: نشانه‌های فشار یا استرس: فیزیولوژیکی، روانی و رفتاری است و می‌تواند موجب اختلال در سوخت و ساز بدن شود، ضربان قلب را بالا ببرد، فشار خون را افزایش دهد، سردرد بیاورد و شخص را مستعد حمله قلبی کند. رشد سریع در دوران بلوغ، یائسگی، بالا رفتن سن، بیماری، در معرض سرمای طولانی بودن از جمله عواملی هستند که بدن را تحت فشار قرار می‌دهند.
broader: تنش
preferred label: Physiological stress @en
type: Concept