هواپیماربایی
scope note: در اختیار گرفتن کنترل هواپیمای در حال پرواز به قصد ربودن و با توسل به هر شیوه و وسیله‌ای، توسط فرد یا افرادی از داخل یا خارج از هواپیما.
related: گروگان
preferred label: Hijacking @en
type: Concept

گروگان
preferred label: Hostage @en
type: Concept
related: هواپیماربایی