سیستم هشدار
preferred label: Alarm system @en
type: Concept
related: علامت گرفتاری و خطر

علامت گرفتاری و خطر
alternative label: سیگنال امدادجویی
scope note: Devices intended for signalling, warning or rescue. @en
scope note: وسایل و ابزار دادن علامت، اعلام خطر یا نجات.
related: منور
related: سیستم هشدار
preferred label: Distress signal @en
type: Concept

منور
preferred label: Flare @en
type: Concept
related: علامت گرفتاری و خطر