سیستم اطلاعات جغرافیایی
preferred label: Geographic Information System @en
type: Concept
related: عکسبرداری هوایی

عکاسی
preferred label: Photography @en
type: Concept
related: عکسبرداری هوایی

عکسبرداری هوایی
scope note: تهیه اطلاعات از طریق عکسبرداری هوایی که سه نوع آن عبارتند از: راهبردی، تاکتیکی و نقشه‌نگاری.
related: عکاسی
related: سیستم اطلاعات جغرافیایی
preferred label: Aerial photography @en
type: Concept