ارتباط
preferred label: Communication @en
type: Concept
related: تفکر گروهی

مدیریت
preferred label: Management @en
type: Concept
related: تفکر گروهی

تفکر گروهی
alternative label: فکر گروهی
scope note: تصمیم‌گیری توسط یک گروه به‌ویژه وقتی با پذیرش غیرانتقادی یا سازگاری با نقطه‌نظرهای غالب در گروه همراه باشد.
related: ارتباط
related: مدیریت
preferred label: Group think @en
type: Concept