هشداردهی سیل
preferred label: Flood warning @en
type: Concept
narrower: هشداردهی وقوع سیل

هشداردهی وقوع سیل
alternative label: اعلام خطر وقوع سیل
scope note: A warning issued by the Bureau of meteorology when flood producing rains are occuring or are expected over particular river catchments. @en
scope note: هشدار سازمان هواشناسی در ارتباط با بارندگی‌هایی که ممکن است در حوضه‌های آبگیر رودخانه خاصی باعث وقوع سیل شود.
broader: هشداردهی سیل
preferred label: Preliminary flood warning @en
type: Concept