تغییر دمای جهانی
scope note: اگر افزایش تراکم گازهای گلخانه‌ای (مثل بخار آب، کربن دی‌اکسید، اکسید نیتروژن، متان، اوزون جو پایین، کلروفلوئوروکربن، پرفلوئوروکربن، هیدروفلوئوروکربن) ادامه داشته باشد، دمای جهانی ممکن است تا سال 2100 در حدود پنج و نیم درجه سانتیگراد افزایش یابد.
related: گرم‌شدن جهانی
preferred label: Global temperature change @en
type: Concept

گرم‌شدن جهانی
preferred label: Global warming @en
type: Concept
related: تغییر دمای جهانی