نقشه‌برداری
preferred label: Mapping @en
type: Concept
related: ترسیم نقشه خطر

ترسیم نقشه خطر
alternative label: نقشه‌برداری خطر
scope note: The process of establishing geographically where and to what extent particular phenomena are likely to pose a threat to people, property, infrastructure, and economic activities. @en
scope note: فرایند تعیین محل جغرافیایی و شدت پدیده‌های خاص که ممکن است تهدیدی برای مردم، اموال، ساختمان‌های زیربنائی و فعالیت‌های اقتصادی باشد. نقشه خطر، ارزیابی خطر را روی نقشه ارائه می‌دهد و فراوانی و احتمال وقوع خطرها را با شدت‌های مختلف نشان می‌دهد.
related: نقشه‌برداری
preferred label: Hazard mapping @en
type: Concept