تدارک‌رسانی به نیروها
alternative label: پشتیبانی تدارکات عملیات
scope note: A Range of operational activities concerned with supply, handling, transportation, distribution of materials. Also applicable to the transportation of people. @en
scope note: تدارک رسانی عملیات نظامی و نیز عملیات میدانی غیرنظامی که کار تهیه وسایل مربوط به حمل‌ونقل، تأمین معاش نیروها، نگهداری تجهیزات و عرضه تدارکات را انجام می‌دهد.
related: مدیریت وضع اضطراری
preferred label: Logistics @en
type: Concept

مدیریت وضع اضطراری
preferred label: Emergency management @en
type: Concept
related: تدارک‌رسانی به نیروها