Dust
preferred label: غبار @fa
type: Concept
related: Vapor

Smoke
preferred label: دود @fa
type: Concept
related: Vapor

Vapor
type: Concept
scope note: شکل گازی یک ماده. اصطلاح گاز به‌ویژه در مقابل بخار بر ماده‌ای اطلاق می‌شود که در حال طبیعی به حالت گازی موجود است و اصطلاح بخار در مورد ماده‌ای به کار می‌رود که در شرایط متعارفی حالت جامد یا مایع دارد و در شرایط غیرمتعارفی حالت گازی پیدا می‌کند. @fa
scope note: Gaseous form of a substance which is normally in the solid or liquid state at room temprature and pressure.
related: Dust
related: Smoke
related: Fume
related: Gas
preferred label: بخار @fa

Fume
preferred label: غبار شیمیایی @fa
type: Concept
related: Vapor

Gas
preferred label: گاز @fa
type: Concept
related: Vapor