Wind force
scope note: A number on a beafort scale corresponding to the effects produces by winds within a range of speeds.
scope note: رقم اندازه‌گیری بادها که در مقیاس بوفور برای شدت و سرعت بادها در نظر گرفته شده است. @fa
related: Beaufort scale
related: Wind
preferred label: نیروی باد @fa
type: Concept

Beaufort scale
preferred label: مقیاس بوفور @fa
type: Concept
related: Wind force

Wind
preferred label: باد @fa
type: Concept
related: Wind force